Target
Reverse transcriptase/RNaseH
Ligand
BDBM1944
Substrate
Meas. Tech.
ChEMBL_196509 (CHEMBL798323)
IC50
8300±n/a nM
Citation
 Wishka, DGGraber, DRKopta, LAOlmsted, RAFriis, JMHosley, JDAdams, WJSeest, EPCastle, TMDolak, LAKeiser, BJYagi, YJeganathan, ASchlachter, STMurphy, MJCleek, GJNugent, RAPoppe, SMSwaney, SMHan, FWatt, WWhite, WLPoel, TJThomas, RCMorris, J (-)-6-Chloro-2-[(1-furo[2, 3-c]pyridin-5-ylethyl)thio]-4-pyrimidinamine, PNU-142721, a new broad spectrum HIV-1 non-nucleoside reverse transcriptase inhibitor. J Med Chem 41:1357-60 (1998)  
Target
Name:
Reverse transcriptase/RNaseH
Synonyms:
HIV-1 Reverse Transcriptase RNase H Reverse transcriptase/RNaseH
Type:
PROTEIN
Mol. Mass.:
65229.15
Organism:
Human immunodeficiency virus 1
Description:
ChEMBL_1473730
Residue:
566
  
Inhibitor
Name:
BDBM1944
Synonyms:
BHAP deriv. DELAVIRDINE MESYLATE N-[2-({4-[3-(propan-2-ylamino)pyridin-2-yl]piperazin-1-yl}carbonyl)-1H-indol-5-yl]methanesulfonamide U-90152S
Type:
Small organic molecule
Emp. Form.:
C22H28N6O3S
Mol. Mass.:
456.561
SMILES:
CC(C)Nc1cccnc1N1CCN(CC1)C(=O)c1cc2cc(NS(C)(=O)=O)ccc2[nH]1
: