Target
Polyunsaturated fatty acid 5-lipoxygenase
Ligand
BDBM50000541
Substrate
Meas. Tech.
ChEMBL_1840231 (CHEMBL4340446)
IC50
100±n/a nM
Citation
 Ho?ek, JLeláková, VBobál, PPí?ová, HGazdová, MMalaník, MJakubczyk, KVeselý, OLanda, PTemml, VSchuster, DPrachyawarakorn, VPailee, PRen, GZpurný, FOravec, M?mejkal, K Prenylated Stilbenoids Affect Inflammation by Inhibiting the NF-?B/AP-1 Signaling Pathway and Cyclooxygenases and Lipoxygenase. J Nat Prod 82:1839-1848 (2019)  
Target
Name:
Polyunsaturated fatty acid 5-lipoxygenase
Synonyms:
5-LO 5-Lipoxygenase (5-LO) 5-Lipoygenase ALOX5 LOG5 | LOX5_HUMAN
Type:
Enzyme
Mol. Mass.:
77972.74
Organism:
Homo sapiens (Human)
Description:
Recombinant protein was purified from E. coli lysate. After ammonium sulfate precipitation and subsequent steps, the supernatant (S100) was used for 5-LO activity assay.
Residue:
674
  
Inhibitor
Name:
BDBM50000541
Synonyms:
(+-)-1-(1-Benzo[b]thien-2-ylethyl)-1-hydroxyurea CHEMBL93 N-(1-Benzo(b)thien-2-ylethyl)-N-hydroxyurea ZILEUTON | Zyflo (TN)
Type:
Small organic molecule
Emp. Form.:
C11H12N2O2S
Mol. Mass.:
236.29
SMILES:
CC(N(O)C(N)=O)c1cc2ccccc2s1
: