Target
Serine/threonine-protein kinase pim-2
Ligand
BDBM50510171
Substrate
Meas. Tech.
ChEMBL_1840685 (CHEMBL4340984)
IC50
1930±n/a nM
Citation
 Martínez-González, SRodríguez-Arístegui, SGómez de la Oliva, CAHernández, AIGonzález Cantalapiedra, EVarela, CGarcía, ABRabal, OOyarzabal, JBischoff, JRKlett, JAlbarrán, MICebriá, AAjenjo, NGarcía-Serelde, BGómez-Casero, ECuadrado-Urbano, MCebrián, DBlanco-Aparicio, CPastor, J Discovery of novel triazolo[4,3-b]pyridazin-3-yl-quinoline derivatives as PIM inhibitors. Eur J Med Chem 168:87-109 (2019)  
Target
Name:
Serine/threonine-protein kinase pim-2
Synonyms:
PIM2 Pim-2h Serine/threonine-protein kinase PIM | Serine/threonine-protein kinase pim-2 (PIM2)
Type:
Serine/threonine-protein kinase
Mol. Mass.:
34185.93
Organism:
Homo sapiens (Human)
Description:
Q9P1W9
Residue:
311
  
Inhibitor
Name:
BDBM50510171
Synonyms:
CHEMBL4446938
Type:
Small organic molecule
Emp. Form.:
C24H28N8O
Mol. Mass.:
444.5321
SMILES:
CCN1CCOc2c1cnn1c(nnc21)-c1ccc2cccc(NCC3CCNCC3)c2n1
: