Target
Delta-type opioid receptor
Ligand
BDBM50045775
Substrate
Meas. Tech.
ChEMBL_147291 (CHEMBL755878)
Ki
0.312000±n/a nM
Citation
 Thomas, JBMascarella, SWRothman, RBPartilla, JSXu, HMcCullough, KBDersch, CMCantrell, BEZimmerman, DMCarroll, FI Investigation of the N-substituent conformation governing potency and mu receptor subtype-selectivity in (+)-(3R, 4R)-dimethyl-4-(3-hydroxyphenyl)piperidine opioid antagonists. J Med Chem 41:1980-90 (1998)  
Target
Name:
Delta-type opioid receptor
Synonyms:
D-OR-1 Delta opioid receptor OPIATE Delta OPRD1 OPRK1 | opioid receptor, delta 1
Type:
G Protein-Coupled Receptor (GPCR)
Mol. Mass.:
40382.98
Organism:
Homo sapiens (Human)
Description:
Competition binding assays were carried out using membrane preparations from transfected HN9.10 cells that constitutively expressed the delta opioid receptor.
Residue:
372
  
Inhibitor
Name:
BDBM50045775
Synonyms:
(3R,4R)3-[1-(3-Cyclohexyl-3-hydroxy-propyl)-3,4-dimethyl-piperidin-4-yl]-phenol 3-[(3R,4R)-1-((S)-3-Cyclohexyl-3-hydroxy-propyl)-3,4-dimethyl-piperidin-4-yl]-phenol CHEMBL300662 | LY-255582
Type:
Small organic molecule
Emp. Form.:
C22H35NO2
Mol. Mass.:
345.5188
SMILES:
C[C@H]1CN(CC[C@H](O)C2CCCCC2)CC[C@@]1(C)c1cccc(O)c1
: