Target
Bcl-2-like protein 1
Ligand
BDBM53290
Substrate
Meas. Tech.
ChEMBL_1841681 (CHEMBL4341980)
Ki
7850±n/a nM
Citation
 Chen, CNie, YXu, GYang, XFang, HHou, X Design, synthesis and preliminary bioactivity studies of indomethacin derivatives as Bcl-2/Mcl-1 dual inhibitors. Bioorg Med Chem 27:2771-2783 (2019)  
Target
Name:
Bcl-2-like protein 1
Synonyms:
Anti-apoptotic Bcl-2 protein Apoptosis regulator Bcl-X BCL2-like 1 isoform 1 BCL2L1 Bcl-2-like protein 1 (Bcl-XL) Bcl-xL/Bcl-2-binding component 3 Bcl2-antagonist of cell death (BAD)
Type:
Mitochondrion membrane; Single-pass membrane protein
Mol. Mass.:
26039.60
Organism:
Homo sapiens (Human)
Description:
Residue:
233
  
Inhibitor
Name:
BDBM53290
Synonyms:
2-[4-[(4-bromophenyl)sulfonylamino]-1-hydroxynaphthalen-2-yl]sulfanylacetic acid 2-[[4-(brosylamino)-1-hydroxy-2-naphthyl]thio]acetic acid MLS001196198 [(4-{[(4-bromophenyl)sulfonyl]amino}-1-hydroxy-2-naphthyl)thio]acetic acid | cid_992586
Type:
Small organic molecule
Emp. Form.:
C18H14BrNO5S2
Mol. Mass.:
468.341
SMILES:
OC(=O)CSc1cc(NS(=O)(=O)c2ccc(Br)cc2)c2ccccc2c1O
: