Target
Ectonucleotide pyrophosphatase/phosphodiesterase family member 3
Ligand
BDBM50510596
Substrate
Meas. Tech.
ChEMBL_1841863 (CHEMBL4342162)
IC50
214±n/a nM
Citation
 Semreen, MHEl-Gamal, MIUllah, SJalil, SZaib, SAnbar, HSLecka, JSévigny, JIqbal, J Synthesis, biological evaluation, and molecular docking study of sulfonate derivatives as nucleotide pyrophosphatase/phosphodiesterase (NPP) inhibitors. Bioorg Med Chem 27:2741-2752 (2019)  
Target
Name:
Ectonucleotide pyrophosphatase/phosphodiesterase family member 3
Synonyms:
Alkaline phosphodiesterase I E-NPP 3 ENPP3_HUMAN NPPase PD-Ibeta Phosphodiesterase I beta | Phosphodiesterase I/nucleotide pyrophosphatase 3
Type:
PROTEIN
Mol. Mass.:
100124.29
Organism:
Homo sapiens (Human)
Description:
ChEMBL_101240
Residue:
875
  
Inhibitor
Name:
BDBM50510596
Synonyms:
CHEMBL4573280
Type:
Small organic molecule
Emp. Form.:
C22H24F3NO4S
Mol. Mass.:
455.49
SMILES:
FC(F)(F)c1ccc(cc1)S(=O)(=O)Oc1ccc(NC(=O)C2CCCCCCC2)cc1
: