Target
5-hydroxytryptamine receptor 1B
Ligand
BDBM50064816
Substrate
Meas. Tech.
ChEMBL_1350 (CHEMBL616535)
Ki
712.0±n/a nM
Citation
 Law, HDukat, MTeitler, MLee, DKMazzocco, LKamboj, RRampersad, VPrisinzano, TGlennon, RA Benzylimidazolines as h5-HT1B/1D serotonin receptor ligands: a structure-affinity investigation. J Med Chem 41:2243-51 (1998)  
Target
Name:
5-hydroxytryptamine receptor 1B
Synonyms:
5-HT-1B 5-HT1B 5HT1B_HUMAN HTR1DB Serotonin (5-HT) receptor Serotonin Receptor 1B
Type:
G Protein-Coupled Receptor (GPCR)
Mol. Mass.:
43579.17
Organism:
Homo sapiens (Human)
Description:
Receptor binding assays were performed using human clone stably expressed in CHO cells
Residue:
390
  
Inhibitor
Name:
BDBM50064816
Synonyms:
2-(4-tert-Butyl-2-methyl-benzyl)-4,5-dihydro-1H-imidazole | CHEMBL70409
Type:
Small organic molecule
Emp. Form.:
C15H22N2
Mol. Mass.:
230.3486
SMILES:
Cc1cc(ccc1CC1=NCCN1)C(C)(C)C
: