Target
5-hydroxytryptamine receptor 1D
Ligand
BDBM50064826
Substrate
Meas. Tech.
ChEMBL_1719 (CHEMBL875909)
Ki
>5000±n/a nM
Citation
 Law, HDukat, MTeitler, MLee, DKMazzocco, LKamboj, RRampersad, VPrisinzano, TGlennon, RA Benzylimidazolines as h5-HT1B/1D serotonin receptor ligands: a structure-affinity investigation. J Med Chem 41:2243-51 (1998)  
Target
Name:
5-hydroxytryptamine receptor 1D
Synonyms:
5-HT-1D 5-HT1D 5HT1D_HUMAN HTR1DA Serotonin (5-HT) receptor | Serotonin Receptor 1D
Type:
G Protein-Coupled Receptor (GPCR)
Mol. Mass.:
41920.63
Organism:
Homo sapiens (Human)
Description:
Receptor binding assays were performed using human clone stably expressed in CHO cells.
Residue:
377
  
Inhibitor
Name:
BDBM50064826
Synonyms:
CHEMBL306699 | [2-(4-tert-Butyl-2,6-dimethyl-phenyl)-ethyl]-methyl-amine
Type:
Small organic molecule
Emp. Form.:
C15H25N
Mol. Mass.:
219.3657
SMILES:
CNCCc1c(C)cc(cc1C)C(C)(C)C
: