Target
Beta-glucuronidase
Ligand
BDBM50511225
Substrate
Meas. Tech.
ChEMBL_1844168 (CHEMBL4344595)
Ki
21470±n/a nM
Citation
 Dashnyam, PLin, HYChen, CYGao, SYeh, LFHsieh, WCTu, ZLin, CH Substituent Position of Iminocyclitols Determines the Potency and Selectivity for Gut Microbial Xenobiotic-Reactivating Enzymes. J Med Chem 63:4617-4627 (2020)  
Target
Name:
Beta-glucuronidase
Synonyms:
Beta-glucuronidase EMBL:AAI33416.1 Ensembl:ENSBTAP00000000941} | GUSB
Type:
Protein
Mol. Mass.:
74467.69
Organism:
Bos taurus (Bovine)
Description:
EC 3.2.1.31, bovine liver
Residue:
652
  
Inhibitor
Name:
BDBM50511225
Synonyms:
(2S,3R,4R,5S)-3,4,5-Trihydroxypipecolic Acid | CHEMBL442895
Type:
Small organic molecule
Emp. Form.:
C6H11NO5
Mol. Mass.:
177.1552
SMILES:
O[C@H]1CN[C@@H]([C@@H](O)[C@@H]1O)C(O)=O
: