Target
BMP-2-inducible protein kinase
Ligand
BDBM50511375
Substrate
Meas. Tech.
ChEMBL_1844761 (CHEMBL4345188)
IC50
1190±n/a nM
Citation
 Wells, CCouņago, RMLimas, JCAlmeida, TLCook, JGDrewry, DHElkins, JMGileadi, OKapadia, NRLorente-Macias, APickett, JERiemen, ARuela-de-Sousa, RRWillson, TMZhang, CZuercher, WJZutshi, RAxtman, AD SGC-AAK1-1: A Chemical Probe Targeting AAK1 and BMP2K. ACS Med Chem Lett 11:340-345 (2020)  
Target
Name:
BMP-2-inducible protein kinase
Synonyms:
BIKE BMP2K | BMP2K_HUMAN
Type:
PROTEIN
Mol. Mass.:
129169.50
Organism:
Homo sapiens (Human)
Description:
ChEMBL_774589
Residue:
1161
  
Inhibitor
Name:
BDBM50511375
Synonyms:
CHEMBL4593649
Type:
Small organic molecule
Emp. Form.:
C24H21FN4O3S
Mol. Mass.:
464.512
SMILES:
Fc1cccc(CS(=O)(=O)Nc2cccc(c2)-c2ccc3c(NC(=O)C4CC4)n[nH]c3c2)c1
: