Target
BMP-2-inducible protein kinase
Ligand
BDBM50511396
Substrate
Meas. Tech.
ChEMBL_1844761 (CHEMBL4345188)
IC50
3830±n/a nM
Citation
 Wells, CCouņago, RMLimas, JCAlmeida, TLCook, JGDrewry, DHElkins, JMGileadi, OKapadia, NRLorente-Macias, APickett, JERiemen, ARuela-de-Sousa, RRWillson, TMZhang, CZuercher, WJZutshi, RAxtman, AD SGC-AAK1-1: A Chemical Probe Targeting AAK1 and BMP2K. ACS Med Chem Lett 11:340-345 (2020)  
Target
Name:
BMP-2-inducible protein kinase
Synonyms:
BIKE BMP2K | BMP2K_HUMAN
Type:
PROTEIN
Mol. Mass.:
129169.50
Organism:
Homo sapiens (Human)
Description:
ChEMBL_774589
Residue:
1161
  
Inhibitor
Name:
BDBM50511396
Synonyms:
CHEMBL4472438
Type:
Small organic molecule
Emp. Form.:
C22H27N5O3S
Mol. Mass.:
441.546
SMILES:
CCN(CC)S(=O)(=O)NCc1cccc(c1)-c1ccc2c(NC(=O)C3CC3)n[nH]c2c1
: