Target
BMP-2-inducible protein kinase
Ligand
BDBM50511400
Substrate
Meas. Tech.
ChEMBL_1844757 (CHEMBL4345184)
Ki
17±n/a nM
Citation
 Wells, CCouņago, RMLimas, JCAlmeida, TLCook, JGDrewry, DHElkins, JMGileadi, OKapadia, NRLorente-Macias, APickett, JERiemen, ARuela-de-Sousa, RRWillson, TMZhang, CZuercher, WJZutshi, RAxtman, AD SGC-AAK1-1: A Chemical Probe Targeting AAK1 and BMP2K. ACS Med Chem Lett 11:340-345 (2020)  
Target
Name:
BMP-2-inducible protein kinase
Synonyms:
BIKE BMP2K | BMP2K_HUMAN
Type:
PROTEIN
Mol. Mass.:
129169.50
Organism:
Homo sapiens (Human)
Description:
ChEMBL_774589
Residue:
1161
  
Inhibitor
Name:
BDBM50511400
Synonyms:
CHEMBL4535040
Type:
Small organic molecule
Emp. Form.:
C21H22N4O3S
Mol. Mass.:
410.489
SMILES:
O=C(Nc1n[nH]c2cc(ccc12)-c1cccc(NS(=O)(=O)C2CCC2)c1)C1CC1
: