Target
Dihydrofolate reductase
Ligand
BDBM50066488
Substrate
Meas. Tech.
ChEMBL_54900 (CHEMBL664709)
IC50
1600±n/a nM
Citation
 Gangjee, AVidwans, APVasudevan, AQueener, SFKisliuk, RLCody, VLi, RGalitsky, NLuft, JRPangborn, W Structure-based design and synthesis of lipophilic 2,4-diamino-6-substituted quinazolines and their evaluation as inhibitors of dihydrofolate reductases and potential antitumor agents. J Med Chem 41:3426-34 (1998)  
Target
Name:
Dihydrofolate reductase
Synonyms:
DYR_LACCA folA
Type:
PROTEIN
Mol. Mass.:
18437.08
Organism:
Lactobacillus casei
Description:
ChEMBL_1357878
Residue:
163
  
Inhibitor
Name:
BDBM50066488
Synonyms:
CHEMBL114833 | N*6*-(2,4,5-Trimethoxy-benzyl)-quinazoline-2,4,6-triamine
Type:
Small organic molecule
Emp. Form.:
C18H21N5O3
Mol. Mass.:
355.391
SMILES:
COc1cc(OC)c(OC)cc1CNc1ccc2nc(N)nc(N)c2c1
: