Target
Adenosine receptor A3
Ligand
BDBM50067076
Substrate
Meas. Tech.
ChEMBL_31996 (CHEMBL646593)
Ki
20000000±n/a nM
Citation
 van Muijlwijk-Koezen, JETimmerman, HLink, Rvan der Goot, HIjzerman, AP A novel class of adenosine A3 receptor ligands. 2. Structure affinity profile of a series of isoquinoline and quinazoline compounds. J Med Chem 41:3994-4000 (1998)  
Target
Name:
Adenosine receptor A3
Synonyms:
A3 adenosine receptor (hA3) ADORA3 | Adenosine A3 receptor (A3AR)
Type:
G Protein-Coupled Receptor (GPCR)
Mol. Mass.:
36197.32
Organism:
Homo sapiens (Human)
Description:
P0DMS8
Residue:
318
  
Inhibitor
Name:
BDBM50067076
Synonyms:
CHEMBL341025 | N-(3-Pyridin-2-yl-isoquinolin-1-yl)-formamidine
Type:
Small organic molecule
Emp. Form.:
C15H12N4
Mol. Mass.:
248.2826
SMILES:
NC=Nc1nc(cc2ccccc12)-c1ccccn1
: