Target
High affinity nerve growth factor receptor
Ligand
BDBM364431
Substrate
Meas. Tech.
ChEMBL_1848918 (CHEMBL4349459)
IC50
0.660000±n/a nM
Citation
 Miao, QMa, KChen, DWu, XJiang, S Targeting tropomyosin receptor kinase for cancer therapy. Eur J Med Chem 175:129-148 (2019)  
Target
Name:
High affinity nerve growth factor receptor
Synonyms:
2.7.10.1 NTRK1 NTRK1_HUMAN Neurotrophic tyrosine kinase receptor type 1 Synonyms=MTC TRK1-transforming tyrosine kinase protein TRKA GN Trk-A Tropomyosin-related kinase A Tyrosine kinase receptor Tyrosine kinase receptor A Tyrosine kinase receptor A (Trk-A) gp140trk | p140-TrkA
Type:
Mol. Mass.:
87498.18
Organism:
Homo sapiens (Human)
Description:
P04629
Residue:
796
  
Inhibitor
Name:
BDBM364431
Synonyms:
2-fluoro-5-(1-methyl-1H-pyrazol-3- yl)-N-(2-phenyl-2H-pyrazolo[4,3- b]pyridin-3-yl)-4- (trifluoromethyl)benzamide | US9862707, Example 5
Type:
Small organic molecule
Emp. Form.:
C24H16F4N6O
Mol. Mass.:
480.4171
SMILES:
Cn1ccc(n1)-c1cc(C(=O)Nc2n(nc3cccnc23)-c2ccccc2)c(F)cc1C(F)(F)F
: