Target
CAD protein
Ligand
BDBM50020110
Substrate
Meas. Tech.
ChEMBL_52877 (CHEMBL876720)
Ki
140±n/a nM
Citation
 Manthey, MKHuang, DTBubb, WAChristopherson, RI Synthesis and enzymic evaluation of 4-mercapto-6-oxo-1, 4-azaphosphinane-2-carboxylic acid 4-oxide as an inhibitor of mammalian dihydroorotase. J Med Chem 41:4550-5 (1998)  
Target
Name:
CAD protein
Synonyms:
Aspartate carbamoyltransferase CAD protein Glutamine-dependent carbamoyl-phosphate synthase | PYR1_HUMAN
Type:
PROTEIN
Mol. Mass.:
242977.40
Organism:
Homo sapiens (Human)
Description:
ChEMBL_52877
Residue:
2225
  
Inhibitor
Name:
BDBM50020110
Synonyms:
(4S,6R)-6-Mercaptomethyl-2-oxo-hexahydro-pyrimidine-4-carboxylic acid CHEMBL29908
Type:
Small organic molecule
Emp. Form.:
C6H10N2O3S
Mol. Mass.:
190.22
SMILES:
OC(=O)[C@@H]1C[C@H](CS)NC(=O)N1
: