Target
CAD protein
Ligand
BDBM50067883
Substrate
Meas. Tech.
ChEMBL_52877 (CHEMBL876720)
Ki
4000±n/a nM
Citation
 Manthey, MKHuang, DTBubb, WAChristopherson, RI Synthesis and enzymic evaluation of 4-mercapto-6-oxo-1, 4-azaphosphinane-2-carboxylic acid 4-oxide as an inhibitor of mammalian dihydroorotase. J Med Chem 41:4550-5 (1998)  
Target
Name:
CAD protein
Synonyms:
Aspartate carbamoyltransferase CAD protein Glutamine-dependent carbamoyl-phosphate synthase | PYR1_HUMAN
Type:
PROTEIN
Mol. Mass.:
242977.40
Organism:
Homo sapiens (Human)
Description:
ChEMBL_52877
Residue:
2225
  
Inhibitor
Name:
BDBM50067883
Synonyms:
4-Hydroxy-4,6-dioxo-4lambda*5*-[1,4]azaphosphinane-2-carboxylic acid | CHEMBL336479
Type:
Small organic molecule
Emp. Form.:
C5H8NO5P
Mol. Mass.:
193.0945
SMILES:
OC(=O)C1NC(=O)CP(O)(O)=C1
: