Target
CAD protein
Ligand
BDBM50291969
Substrate
Meas. Tech.
ChEMBL_52877 (CHEMBL876720)
Ki
3100±n/a nM
Citation
 Manthey, MKHuang, DTBubb, WAChristopherson, RI Synthesis and enzymic evaluation of 4-mercapto-6-oxo-1, 4-azaphosphinane-2-carboxylic acid 4-oxide as an inhibitor of mammalian dihydroorotase. J Med Chem 41:4550-5 (1998)  
Target
Name:
CAD protein
Synonyms:
Aspartate carbamoyltransferase CAD protein Glutamine-dependent carbamoyl-phosphate synthase | PYR1_HUMAN
Type:
PROTEIN
Mol. Mass.:
242977.40
Organism:
Homo sapiens (Human)
Description:
ChEMBL_52877
Residue:
2225
  
Inhibitor
Name:
BDBM50291969
Synonyms:
(2R,4S)-4-Mercapto-4,6-dioxo-4lambda*5*-[1,4]azaphosphinane-2-carboxylic acid | CHEMBL141678
Type:
Small organic molecule
Emp. Form.:
C5H8NO4PS
Mol. Mass.:
209.16
SMILES:
OC(=O)[C@H]1NC(=O)CP(O)(S)=C1
: