Target
Beta-lactamase
Ligand
BDBM26139
Substrate
Meas. Tech.
ChEMBL_35526 (CHEMBL649552)
IC50
150±n/a nM
Citation
 Weston, GSBlázquez, JBaquero, FShoichet, BK Structure-based enhancement of boronic acid-based inhibitors of AmpC beta-lactamase. J Med Chem 41:4577-86 (1998)  
Target
Name:
Beta-lactamase
Synonyms:
AMPC_ECOLI Beta-lactamase (AmpC) Cephalosporinase ampA | ampC
Type:
Protien
Mol. Mass.:
41561.62
Organism:
Escherichia coli
Description:
P00811
Residue:
377
  
Inhibitor
Name:
BDBM26139
Synonyms:
1-benzothiophen-2-ylboranediol CHEMBL34964 | Phenylboronic acid, 11
Type:
Emp. Form.:
C8H7BO2S
Mol. Mass.:
178.016
SMILES:
OB(O)c1cc2ccccc2s1
: