Target
E3 ubiquitin-protein ligase XIAP
Ligand
BDBM50512890
Substrate
Meas. Tech.
ChEMBL_1850527 (CHEMBL4351151)
IC50
1.4±n/a nM
Citation
 Cong, HXu, LWu, YQu, ZBian, TZhang, WXing, CZhuang, C Inhibitor of Apoptosis Protein (IAP) Antagonists in Anticancer Agent Discovery: Current Status and Perspectives. J Med Chem 62:5750-5772 (2019)  
Target
Name:
E3 ubiquitin-protein ligase XIAP
Synonyms:
API3 E3 ubiquitin-protein ligase XIAP Inhibitor of apoptosis protein 3 X-linked inhibitor of apoptosis XIAP | XIAP_HUMAN
Type:
Protein
Mol. Mass.:
56685.27
Organism:
Homo sapiens (Human)
Description:
P98170
Residue:
497
  
Inhibitor
Name:
BDBM50512890
Synonyms:
CHEMBL4575701
Type:
Small organic molecule
Emp. Form.:
C62H84N14O6
Mol. Mass.:
1121.4206
SMILES:
[H][C@]12CC[C@H](N1C(=O)C(CCCC2)NC(=O)[C@H](C)NC)C(=O)N[C@H](c1cn(CCCCc2ccc(CCCCn3cc(nn3)[C@@H](NC(=O)[C@@H]3CC[C@]4([H])CCCC[C@H](NC(=O)[C@H](C)NC)C(=O)N34)c3ccccc3)cc2)nn1)c1ccccc1
: