Target
Histone acetyltransferase KAT2B
Ligand
BDBM50512957
Substrate
Meas. Tech.
ChEMBL_1850994 (CHEMBL4351618)
Kd
>10000±n/a nM
Citation
 Huang, LLi, HLi, LNiu, LSeupel, RWu, CCheng, WChen, CDing, BBrennan, PEYang, S Discovery of Pyrrolo[3,2- d]pyrimidin-4-one Derivatives as a New Class of Potent and Cell-Active Inhibitors of P300/CBP-Associated Factor Bromodomain. J Med Chem 62:4526-4542 (2019)  
Target
Name:
Histone acetyltransferase KAT2B
Synonyms:
Histone acetyltransferase KAT2A/KAT2B KAT2B PCAF
Type:
PROTEIN
Mol. Mass.:
93045.76
Organism:
Homo sapiens (Human)
Description:
ChEMBL_1502838
Residue:
832
  
Inhibitor
Name:
BDBM50512957
Synonyms:
CHEMBL4460616
Type:
Small organic molecule
Emp. Form.:
C21H25N5O
Mol. Mass.:
363.4561
SMILES:
[H][C@]12CC[C@]([H])(C[C@H](C1)Nc1nc3cc[nH]c3c(=O)n1C)N2Cc1ccccc1
: