Target
Histone acetyltransferase KAT2B
Ligand
BDBM50398244
Substrate
Meas. Tech.
ChEMBL_1850993 (CHEMBL4351617)
IC50
1600±n/a nM
Citation
 Huang, LLi, HLi, LNiu, LSeupel, RWu, CCheng, WChen, CDing, BBrennan, PEYang, S Discovery of Pyrrolo[3,2- d]pyrimidin-4-one Derivatives as a New Class of Potent and Cell-Active Inhibitors of P300/CBP-Associated Factor Bromodomain. J Med Chem 62:4526-4542 (2019)  
Target
Name:
Histone acetyltransferase KAT2B
Synonyms:
Histone acetyltransferase KAT2A/KAT2B KAT2B PCAF
Type:
PROTEIN
Mol. Mass.:
93045.76
Organism:
Homo sapiens (Human)
Description:
ChEMBL_1502838
Residue:
832
  
Inhibitor
Name:
BDBM50398244
Synonyms:
CHEMBL609728
Type:
Small organic molecule
Emp. Form.:
C10H15N3O2
Mol. Mass.:
209.245
SMILES:
Cc1ccc(NCCCN)c(c1)[N+]([O-])=O
: