Target
Serine-protein kinase ATM
Ligand
BDBM420852
Substrate
Meas. Tech.
ChEMBL_1852127 (CHEMBL4352751)
Ki
115±n/a nM
Citation
 Knegtel, RCharrier, JDDurrant, SDavis, CO'Donnell, MStorck, PMacCormick, SKay, DPinder, JVirani, ATwin, HGriffiths, MReaper, PLittlewood, PYoung, SGolec, JPollard, J Rational Design of 5-(4-(Isopropylsulfonyl)phenyl)-3-(3-(4-((methylamino)methyl)phenyl)isoxazol-5-yl)pyrazin-2-amine (VX-970, M6620): Optimization of Intra- and Intermolecular Polar Interactions of a New Ataxia Telangiectasia Mutated and Rad3-Related (ATR) Kinase Inhibitor. J Med Chem 62:5547-5561 (2019)  
Target
Name:
Serine-protein kinase ATM
Synonyms:
A-T mutated ATM_HUMAN | Ataxia telangiectasia mutated
Type:
Protein
Mol. Mass.:
350696.72
Organism:
Homo sapiens (Human)
Description:
Q13315
Residue:
3056
  
Inhibitor
Name:
BDBM420852
Synonyms:
US10479784, Compound IIA-5 | US10961232, Compound IIA-5
Type:
Small organic molecule
Emp. Form.:
C23H23N5O3S
Mol. Mass.:
449.525
SMILES:
CC(C)S(=O)(=O)c1ccc(cc1)-c1cnc(N)c(n1)-c1cc(no1)-c1ccc(CN)cc1
: