Target
Lysine-specific demethylase 5B
Ligand
BDBM50513348
Substrate
Meas. Tech.
ChEMBL_1853107 (CHEMBL4353731)
Ki
4.0±n/a nM
Citation
 Le Bihan, YVLanigan, RMAtrash, BMcLaughlin, MGVelupillai, SMalcolm, AGEngland, KSRuda, GFMok, NYTumber, ATomlin, KSaville, HShehu, EMcAndrew, CCarmichael, LBennett, JMJeganathan, FEve, PDonovan, AHayes, AWood, FRaynaud, FIFedorov, OBrennan, PEBurke, Rvan Montfort, RLMRossanese, OWBlagg, JBavetsias, V C8-substituted pyrido[3,4-d]pyrimidin-4(3H)-ones: Studies towards the identification of potent, cell penetrant Jumonji C domain containing histone lysine demethylase 4 subfamily (KDM4) inhibitors, compound profiling in cell-based target engagement assays. Eur J Med Chem 177:316-337 (2019)  
Target
Name:
Lysine-specific demethylase 5B
Synonyms:
CT31 Histone demethylase JARID1B Jumonji/ARID domain-containing protein 1B KDM5B_HUMAN Lysine-specific demethylase 5B (KDM5Flag-5B-FL) PLU1 RBP2-H1 | Retinoblastoma-binding protein 2 homolog 1
Type:
Protein
Mol. Mass.:
175659.67
Organism:
Homo sapiens (Human)
Description:
Q9UGL1
Residue:
1544
  
Inhibitor
Name:
BDBM50513348
Synonyms:
CHEMBL4585876
Type:
Small organic molecule
Emp. Form.:
C27H33N7O
Mol. Mass.:
471.5972
SMILES:
CN(C)CCc1ccc(cc1)C1CCN(CCc2cnn(c2)-c2nccc3c2nc[nH]c3=O)CC1
: