Target
Poly [ADP-ribose] polymerase 1
Ligand
BDBM50068769
Substrate
Meas. Tech.
ChEMBL_159664 (CHEMBL761792)
IC50
8000±n/a nM
Citation
 Griffin, RJSrinivasan, SBowman, KCalvert, AHCurtin, NJNewell, DRPemberton, LCGolding, BT Resistance-modifying agents. 5. Synthesis and biological properties of quinazolinone inhibitors of the DNA repair enzyme poly(ADP-ribose) polymerase (PARP). J Med Chem 41:5247-56 (1999)  
Target
Name:
Poly [ADP-ribose] polymerase 1
Synonyms:
Adprp Adprt1 Parp1 Poly [ADP-ribose] polymerase-1
Type:
PROTEIN
Mol. Mass.:
113131.74
Organism:
Mus musculus
Description:
ChEMBL_159828
Residue:
1013
  
Inhibitor
Name:
BDBM50068769
Synonyms:
3-Hydroxy-benzamide CHEMBL419424
Type:
Small organic molecule
Emp. Form.:
C7H7NO2
Mol. Mass.:
137.136
SMILES:
NC(=O)c1cccc(O)c1
: