Target
Nuclear receptor subfamily 1 group I member 3
Ligand
BDBM50513499
Substrate
Meas. Tech.
ChEMBL_1853466 (CHEMBL4354090)
EC50
2100±n/a nM
Citation
 Liang, DLi, LLynch, CMackowiak, BHedrich, WDAi, YYin, YHeyward, SXia, MWang, HXue, F Human constitutive androstane receptor agonist DL5016: A novel sensitizer for cyclophosphamide-based chemotherapies. Eur J Med Chem 179:84-99 (2019)  
Target
Name:
Nuclear receptor subfamily 1 group I member 3
Synonyms:
CAR NR1I3_HUMAN
Type:
PROTEIN
Mol. Mass.:
39953.17
Organism:
Homo sapiens (Human)
Description:
ChEMBL_1434936
Residue:
352
  
Inhibitor
Name:
BDBM50513499
Synonyms:
CHEMBL4568159
Type:
Small organic molecule
Emp. Form.:
C20H17ClFN3S
Mol. Mass.:
385.885
SMILES:
Fc1ccc(CCNCc2c(nc3sccn23)-c2ccc(Cl)cc2)cc1
: