Target
Nuclear receptor subfamily 1 group I member 3
Ligand
BDBM50513510
Substrate
Meas. Tech.
ChEMBL_1853466 (CHEMBL4354090)
EC50
930±n/a nM
Citation
 Liang, DLi, LLynch, CMackowiak, BHedrich, WDAi, YYin, YHeyward, SXia, MWang, HXue, F Human constitutive androstane receptor agonist DL5016: A novel sensitizer for cyclophosphamide-based chemotherapies. Eur J Med Chem 179:84-99 (2019)  
Target
Name:
Nuclear receptor subfamily 1 group I member 3
Synonyms:
CAR NR1I3_HUMAN
Type:
PROTEIN
Mol. Mass.:
39953.17
Organism:
Homo sapiens (Human)
Description:
ChEMBL_1434936
Residue:
352
  
Inhibitor
Name:
BDBM50513510
Synonyms:
CHEMBL4453764
Type:
Small organic molecule
Emp. Form.:
C20H16Cl3N3S
Mol. Mass.:
436.785
SMILES:
Clc1cccc(c1)-c1nc2sccn2c1CNCCc1ccc(Cl)c(Cl)c1
: