Target
Nuclear receptor subfamily 1 group I member 3
Ligand
BDBM50513512
Substrate
Meas. Tech.
ChEMBL_1853466 (CHEMBL4354090)
EC50
1100±n/a nM
Citation
 Liang, DLi, LLynch, CMackowiak, BHedrich, WDAi, YYin, YHeyward, SXia, MWang, HXue, F Human constitutive androstane receptor agonist DL5016: A novel sensitizer for cyclophosphamide-based chemotherapies. Eur J Med Chem 179:84-99 (2019)  
Target
Name:
Nuclear receptor subfamily 1 group I member 3
Synonyms:
CAR NR1I3_HUMAN
Type:
PROTEIN
Mol. Mass.:
39953.17
Organism:
Homo sapiens (Human)
Description:
ChEMBL_1434936
Residue:
352
  
Inhibitor
Name:
BDBM50513512
Synonyms:
CHEMBL4445221
Type:
Small organic molecule
Emp. Form.:
C21H18Cl3N3S
Mol. Mass.:
450.812
SMILES:
CN(CCc1ccc(Cl)c(Cl)c1)Cc1c(nc2sccn12)-c1ccc(Cl)cc1
: