Target
3-oxo-5-alpha-steroid 4-dehydrogenase 1/2
Ligand
BDBM50216728
Substrate
Meas. Tech.
ChEMBL_225417 (CHEMBL847453)
IC50
26±n/a nM
Citation
 Ishibashi, KNakajima, KSugioka, YSugiyama, MHamada, THorikoshi, HNishi, T Synthesis and 5 alpha-reductase inhibitory activities of benzofuran derivatives with a carbamoyl group. Bioorg Med Chem Lett 8:561-6 (1999)  
Target
Name:
3-oxo-5-alpha-steroid 4-dehydrogenase 1/2
Synonyms:
Steroid 5-alpha-reductase
Type:
Mol. Mass.:
Description:
ASSAY_ID of ChEMBL is 204723
Components:
This complex has 2 components.
Component 1
Name:
3-oxo-5-alpha-steroid 4-dehydrogenase 1
Synonyms:
S5A1_RAT Steroid 5-alpha-reductase | Steroid 5-alpha-reductase 1
Type:
PROTEIN
Mol. Mass.:
29788.29
Organism:
Rattus norvegicus
Description:
ChEMBL_1441437
Residue:
259
  
Component 2
Name:
3-oxo-5-alpha-steroid 4-dehydrogenase 2
Synonyms:
S5A2_RAT Steroid 5-alpha-reductase | Steroid 5-alpha-reductase 2
Type:
PROTEIN
Mol. Mass.:
28784.15
Organism:
Rattus norvegicus
Description:
ChEMBL_205054
Residue:
254
  
Inhibitor
Name:
BDBM50216728
Synonyms:
CHEMBL359360
Type:
Small organic molecule
Emp. Form.:
C34H31NO7
Mol. Mass.:
565.6124
SMILES:
COc1ccc(cc1)C(NC(=O)c1ccc2oc(cc2c1)-c1ccccc1OCCCC(O)=O)c1ccc(OC)cc1
: