Target
Acetylcholinesterase
Ligand
BDBM50069246
Substrate
Meas. Tech.
ChEMBL_27796 (CHEMBL637623)
Ki
7000±n/a nM
Citation
 Perola, ECellai, LBrufani, M Synthesis and activity studies of N-[omega-N'-(adamant-1'-yl)aminoalkyl]- 2-(4'-dimethylaminophenyl)acetamides: in the search of selective inhibitors for the different molecular forms of acetylcholinesterase. Bioorg Med Chem Lett 8:575-80 (1999)  
Target
Name:
Acetylcholinesterase
Synonyms:
3.1.1.7 Acetylcholinesterase (AChE) ache
Type:
Mol. Mass.:
65900.74
Organism:
Tetronarce californica (Pacific electric ray) (Torpedo californica)
Description:
P04058
Residue:
586
  
Inhibitor
Name:
BDBM50069246
Synonyms:
CHEMBL152361 | N-[7-(Adamantan-1-ylamino)-heptyl]-2-(4-dimethylamino-phenyl)-acetamide
Type:
Small organic molecule
Emp. Form.:
C27H43N3O
Mol. Mass.:
425.6498
SMILES:
CN(C)c1ccc(CC(=O)NCCCCCCCNC23CC4CC(CC(C4)C2)C3)cc1
: