Target
Cruzipain
Ligand
BDBM50514675
Substrate
Meas. Tech.
ChEMBL_1858190 (CHEMBL4358919)
Ki
3.6±n/a nM
Citation
 Chenna, BCLi, LMellott, DMZhai, XSiqueira-Neto, JLCalvet Alvarez, CBernatchez, JADesormeaux, EAlvarez Hernandez, EGomez, JMcKerrow, JHCruz-Reyes, JMeek, TD Peptidomimetic Vinyl Heterocyclic Inhibitors of Cruzain Effect Antitrypanosomal Activity. J Med Chem 63:3298-3316 (2020)  
Target
Name:
Cruzipain
Synonyms:
CYSP_TRYCR Cruzaine | Major cysteine proteinase
Type:
Protein
Mol. Mass.:
49831.41
Organism:
Trypanosoma cruzi
Description:
P25779
Residue:
467
  
Inhibitor
Name:
BDBM50514675
Synonyms:
CHEMBL4472987
Type:
Small organic molecule
Emp. Form.:
C33H32N2O5S
Mol. Mass.:
568.683
SMILES:
O=C(N[C@@H](Cc1ccccc1)C(=O)N[C@@H](Cc1ccccc1)\C=C\S(=O)(=O)c1ccccc1)OCc1ccccc1
: