Target
Potassium channel subfamily K member 2
Ligand
BDBM50514764
Substrate
Meas. Tech.
ChEMBL_1858334 (CHEMBL4359063)
EC50
3910±n/a nM
Citation
 Qiu, YHuang, LFu, JHan, CFang, JLiao, PChen, ZMo, YSun, PLiao, DYang, LWang, JZhang, QLiu, JLiu, FLiu, THuang, WYang, HJiang, R TREK Channel Family Activator with a Well-Defined Structure-Activation Relationship for Pain and Neurogenic Inflammation. J Med Chem 63:3665-3677 (2020)  
Target
Name:
Potassium channel subfamily K member 2
Synonyms:
KCNK2 Outward rectifying potassium channel protein TREK-1 TREK-1 K(+) channel subunit Twik-RElated Potassium (K+) channel 1 (TREK1) Two pore potassium channel TPKC1
Type:
Protein
Mol. Mass.:
47099.16
Organism:
Homo sapiens (Human)
Description:
O95069
Residue:
426
  
Inhibitor
Name:
BDBM50514764
Synonyms:
CHEMBL4552751
Type:
Small organic molecule
Emp. Form.:
C21H20N2O3S
Mol. Mass.:
380.46
SMILES:
Cc1ccc2nc(sc2c1)-c1ccc(NC(=O)[C@@H]2CC[C@@H](C2)C(O)=O)cc1
: