Target
Beta-1 adrenergic receptor
Ligand
BDBM50070130
Substrate
Meas. Tech.
ChEMBL_37250 (CHEMBL651571)
EC50
450±n/a nM
Citation
 Weber, AEMathvink, RJPerkins, LHutchins, JECandelore, MRTota, LStrader, CDWyvratt, MJFisher, MH Potent, selective benzenesulfonamide agonists of the human beta 3 adrenergic receptor. Bioorg Med Chem Lett 8:1101-6 (1999)  
Target
Name:
Beta-1 adrenergic receptor
Synonyms:
ADRB1 ADRB1_HUMAN Beta-1 adrenoceptor adrenergic Beta1
Type:
G Protein-Coupled Receptor (GPCR)
Mol. Mass.:
51338.40
Organism:
Homo sapiens (Human)
Description:
P08588
Residue:
477
  
Inhibitor
Name:
BDBM50070130
Synonyms:
4-Chloro-N-(4-{2-[(S)-2-hydroxy-3-(4-hydroxy-phenoxy)-propylamino]-ethyl}-phenyl)-benzenesulfonamide | CHEMBL12450
Type:
Small organic molecule
Emp. Form.:
C23H25ClN2O5S
Mol. Mass.:
476.973
SMILES:
O[C@@H](CNCCc1ccc(NS(=O)(=O)c2ccc(Cl)cc2)cc1)COc1ccc(O)cc1
: