Target
Mast/stem cell growth factor receptor Kit
Ligand
BDBM50515229
Substrate
Meas. Tech.
ChEMBL_1860355 (CHEMBL4361211)
EC50
<100±n/a nM
Citation
 Wu, YWang, BWang, JQi, SZou, FQi, ZLiu, FLiu, QChen, CHu, CHu, ZWang, AWang, LWang, WRen, TCai, YBai, MLiu, QLiu, J Discovery of 2-(4-Chloro-3-(trifluoromethyl)phenyl)- J Med Chem 62:6083-6101 (2019)  
Target
Name:
Mast/stem cell growth factor receptor Kit
Synonyms:
CD117 antigen KIT Mast/stem cell growth factor receptor Kit (cKIT) Proto-oncogene tyrosine-protein kinase Kit Stem cell growth factor receptor Tyrosine-protein kinase Kit c-kit v-kit Hardy-Zuckerman 4 feline sarcoma viral oncogene homolog
Type:
Protein
Mol. Mass.:
109869.37
Organism:
Homo sapiens (Human)
Description:
P10721
Residue:
976
  
Inhibitor
Name:
BDBM50515229
Synonyms:
CHEMBL4577779
Type:
Small organic molecule
Emp. Form.:
C26H20ClF3N2O4
Mol. Mass.:
516.896
SMILES:
COc1cc2nccc(Oc3ccc(NC(=O)Cc4ccc(Cl)c(c4)C(F)(F)F)cc3)c2cc1OC
: