Target
Carbonic anhydrase 2
Ligand
BDBM50515558
Substrate
Meas. Tech.
ChEMBL_1861556 (CHEMBL4362412)
Ki
0.420000±n/a nM
Citation
 Tanini, DRicci, LCapperucci, ADi Cesare Mannelli, LGhelardini, CPeat, TSCarta, FAngeli, ASupuran, CT Synthesis of novel tellurides bearing benzensulfonamide moiety as carbonic anhydrase inhibitors with antitumor activity. Eur J Med Chem 181:0 (2019)  
Target
Name:
Carbonic anhydrase 2
Synonyms:
CA-II CAC Carbonate dehydratase II Carbonic anhydrase 2 (CA-II) Carbonic anhydrase C Carbonic anhydrase II (CA-II) Carbonic anhydrase II (hCA II) | Carbonic anhydrase isoenzyme II (hCA II)
Type:
Enzyme
Mol. Mass.:
29250.71
Organism:
Homo sapiens (Human)
Description:
P00918
Residue:
260
  
Inhibitor
Name:
BDBM50515558
Synonyms:
CHEMBL4535036
Type:
Small organic molecule
Emp. Form.:
C15H17NO4STe
Mol. Mass.:
435
SMILES:
[#7]S(=O)(=O)c1ccc(-[#8]-[#6]-[#6](-[#8])-[#6][Te;v2]c2ccccc2)cc1
: