Target
Carbonic anhydrase 7
Ligand
BDBM50515559
Substrate
Meas. Tech.
ChEMBL_1861558 (CHEMBL4362414)
Ki
2.7±n/a nM
Citation
 Tanini, DRicci, LCapperucci, ADi Cesare Mannelli, LGhelardini, CPeat, TSCarta, FAngeli, ASupuran, CT Synthesis of novel tellurides bearing benzensulfonamide moiety as carbonic anhydrase inhibitors with antitumor activity. Eur J Med Chem 181:0 (2019)  
Target
Name:
Carbonic anhydrase 7
Synonyms:
CA-VII CAH7_HUMAN Carbonic anhydrase Carbonic anhydrase VII (CA VII)
Type:
Enzyme
Mol. Mass.:
29664.11
Organism:
Homo sapiens (Human)
Description:
Human cloned isozyme.
Residue:
264
  
Inhibitor
Name:
BDBM50515559
Synonyms:
CHEMBL4435078
Type:
Small organic molecule
Emp. Form.:
C16H19NO4STe
Mol. Mass.:
449
SMILES:
[#6]-c1ccc([Te;v2][#6]-[#6](-[#8])-[#6]-[#8]-c2ccc(cc2)S([#7])(=O)=O)cc1
: