Target
Histone deacetylase 8
Ligand
BDBM50322422
Substrate
Meas. Tech.
ChEMBL_1863004 (CHEMBL4363860)
IC50
120±n/a nM
Citation
 Zhang, BLiu, JGao, DYu, XWang, JLei, X A fluorine scan on the Zn Eur J Med Chem 182:0 (2019)  
Target
Name:
Histone deacetylase 8
Synonyms:
HD8 HDAC8_HUMAN Histone deacetylase 8 (HDAC-8) | Human HDAC8
Type:
Enzyme
Mol. Mass.:
41749.60
Organism:
Homo sapiens (Human)
Description:
Q9BY41
Residue:
377
  
Inhibitor
Name:
BDBM50322422
Synonyms:
CHEMBL1173445 | Largazole
Type:
Small organic molecule
Emp. Form.:
C29H42N4O5S3
Mol. Mass.:
622.863
SMILES:
CCCCCCCC(=O)SCC\C=C\[C@@H]1CC(=O)NCc2nc(cs2)C2=N[C@@](C)(CS2)C(=O)N[C@@H](C(C)C)C(=O)O1
: