Target
Integrase
Ligand
BDBM50071060
Substrate
Meas. Tech.
ChEBML_90727
IC50
53000±n/a nM
Citation
 Zhang, JNeamati, NPommier, YNair, V Inhibition of HIV integrase by novel nucleotides bearing tricyclic bases. Bioorg Med Chem Lett 8:1887-90 (1999)  
Target
Name:
Integrase
Synonyms:
Human immunodeficiency virus type 1 integrase
Type:
PROTEIN
Mol. Mass.:
32231.48
Organism:
Human immunodeficiency virus 1
Description:
ChEMBL_90865
Residue:
288
  
Inhibitor
Name:
BDBM50071060
Synonyms:
CHEMBL55906 | Disodium; [4-(6-amino-imidazo[4,5-h]quinazolin-1-yl)-tetrahydro-furan-2-ylmethyl] dihydrogen phosphonium
Type:
Small organic molecule
Emp. Form.:
C14H14N5O5P
Mol. Mass.:
363.2663
SMILES:
Nc1ncnc2c3n(cnc3ccc12)C1COC(COP([O-])([O-])=O)C1
: