Target
Cannabinoid receptor 1
Ligand
BDBM50516243
Substrate
Meas. Tech.
ChEMBL_1863999 (CHEMBL4364974)
Ki
18±n/a nM
Citation
 Amato, GManke, AWiethe, RVasukuttan, VSnyder, RYueh, YLDecker, ARunyon, SMaitra, R Functionalized 6-(Piperidin-1-yl)-8,9-Diphenyl Purines as Peripherally Restricted Inverse Agonists of the CB1 Receptor. J Med Chem 62:6330-6345 (2019)  
Target
Name:
Cannabinoid receptor 1
Synonyms:
CANN6 CB-R CNR CNR1_HUMAN Cannabinoid receptor Cannabinoid receptor 1 (brain)
Type:
G Protein-Coupled Receptor (GPCR)
Mol. Mass.:
52868.96
Organism:
Homo sapiens (Human)
Description:
P21554
Residue:
472
  
Inhibitor
Name:
BDBM50516243
Synonyms:
CHEMBL4450343
Type:
Small organic molecule
Emp. Form.:
C29H29Cl2F2N7O
Mol. Mass.:
600.49
SMILES:
FC1(F)CCC(CC1)NC(=O)NC1CCN(CC1)c1ncnc2n(c(nc12)-c1ccccc1Cl)-c1ccc(Cl)cc1
: