Target
Butyrophilin subfamily 3 member A1
Ligand
BDBM50236893
Substrate
Meas. Tech.
ChEMBL_1866560 (CHEMBL4367535)
IC50
>333000±n/a nM
Citation
 Poe, MMAgabiti, SSLiu, CLi, VTeske, KAHsiao, CCWiemer, AJ Probing the Ligand-Binding Pocket of BTN3A1. J Med Chem 62:6814-6823 (2019)  
Target
Name:
Butyrophilin subfamily 3 member A1
Synonyms:
BT3A1_HUMAN BTN3A1 CD_antigen=CD277
Type:
PROTEIN
Mol. Mass.:
57685.08
Organism:
Homo sapiens (Human)
Description:
ChEMBL_117363
Residue:
513
  
Inhibitor
Name:
BDBM50236893
Synonyms:
CHEBI:15664 | CHEMBL145233
Type:
Small organic molecule
Emp. Form.:
C5H12O8P2
Mol. Mass.:
262.0915
SMILES:
C\C(CO)=C/COP(O)(=O)OP(O)(O)=O
: