Target
Butyrophilin subfamily 3 member A1
Ligand
BDBM50236894
Substrate
Meas. Tech.
ChEMBL_1866567 (CHEMBL4367542)
IC50
3830000±n/a nM
Citation
 Poe, MMAgabiti, SSLiu, CLi, VTeske, KAHsiao, CCWiemer, AJ Probing the Ligand-Binding Pocket of BTN3A1. J Med Chem 62:6814-6823 (2019)  
Target
Name:
Butyrophilin subfamily 3 member A1
Synonyms:
BT3A1_HUMAN BTN3A1 CD_antigen=CD277
Type:
PROTEIN
Mol. Mass.:
57685.08
Organism:
Homo sapiens (Human)
Description:
ChEMBL_117363
Residue:
513
  
Inhibitor
Name:
BDBM50236894
Synonyms:
CHEMBL4060737
Type:
Small organic molecule
Emp. Form.:
C6H13O4P
Mol. Mass.:
180.1388
SMILES:
C\C(CO)=C/CCP(O)(O)=O
: