Target
Butyrophilin subfamily 3 member A1
Ligand
BDBM50236889
Substrate
Meas. Tech.
ChEMBL_1866547 (CHEMBL4367522)
EC50
41±n/a nM
Citation
 Poe, MMAgabiti, SSLiu, CLi, VTeske, KAHsiao, CCWiemer, AJ Probing the Ligand-Binding Pocket of BTN3A1. J Med Chem 62:6814-6823 (2019)  
Target
Name:
Butyrophilin subfamily 3 member A1
Synonyms:
BT3A1_HUMAN BTN3A1 CD_antigen=CD277
Type:
PROTEIN
Mol. Mass.:
57685.08
Organism:
Homo sapiens (Human)
Description:
ChEMBL_117363
Residue:
513
  
Inhibitor
Name:
BDBM50236889
Synonyms:
CHEMBL4061531
Type:
Small organic molecule
Emp. Form.:
C25H46O12P2
Mol. Mass.:
600.5731
SMILES:
C\C(CO)=C/CCP(=O)(CP(=O)(OCOC(=O)C(C)(C)C)OCOC(=O)C(C)(C)C)OCOC(=O)C(C)(C)C
: