Target
Tyrosine-protein kinase Lck
Ligand
BDBM50071666
Substrate
Meas. Tech.
ChEBML_221490
IC50
110±n/a nM
Citation
 Bullington, JLCameron, JCDavis, JEDodd, JHHarris, CAHenry, JRPellegrino-Gensey, JLRupert, KCSiekierka, JJ The development of novel and selective p56lck tyrosine kinase inhibitors. Bioorg Med Chem Lett 8:2489-94 (1999)  
Target
Name:
Tyrosine-protein kinase Lck
Synonyms:
2.7.10.2 LCK_HUMAN Leukocyte C-terminal Src kinase Lymphocyte-specific protein tyrosine kinase Protein YT16 Proto-oncogene tyrosine-protein kinase LCK T cell-specific protein-tyrosine kinase
Type:
Mol. Mass.:
57987.83
Organism:
Homo sapiens (Human)
Description:
P06239
Residue:
509
  
Inhibitor
Name:
BDBM50071666
Synonyms:
2-(3,5-Dibromo-4-hydroxy-benzylidene)-5,6-dimethoxy-indan-1,3-dione | CHEMBL83721
Type:
Small organic molecule
Emp. Form.:
C18H12Br2O5
Mol. Mass.:
468.093
SMILES:
[#6]-[#8]-c1cc2-[#6](=O)\[#6](=[#6]\c3cc(Br)c(-[#8])c(Br)c3)-[#6](=O)-c2cc1-[#8]-[#6]
: