Target
Cholecystokinin receptor type A
Ligand
BDBM50517355
Substrate
Meas. Tech.
ChEMBL_1868966 (CHEMBL4370032)
EC50
0.107152±n/a nM
Citation
 Sensfuss, UKruse, TSkyggebjerg, RBUldam, HKVestergaard, BHuus, KVinther, TNReinau, MESchéele, SClausen, TR Structure-Activity Relationships and Characterization of Highly Selective, Long-Acting, Peptide-Based Cholecystokinin 1 Receptor Agonists. J Med Chem 62:1407-1419 (2019)  
Target
Name:
Cholecystokinin receptor type A
Synonyms:
CCK-A receptor CCK1-R CCKAR_HUMAN Cholecystokinin receptor Cholecystokinin-1 Receptor
Type:
G Protein-Coupled Receptor (GPCR)
Mol. Mass.:
47859.34
Organism:
Homo sapiens (Human)
Description:
Stable expression of human CCK-1 receptors in HEK 293 cells.
Residue:
428
  
Inhibitor
Name:
BDBM50517355
Synonyms:
CHEMBL4471525
Type:
Small organic molecule
Emp. Form.:
C95H137N15O26
Mol. Mass.:
1905.1892
SMILES:
CCCC[C@H](NC(=O)[C@H](Cc1ccc(O)cc1)NC(=O)[C@H](CC(O)=O)NC(=O)COCCOCCNC(=O)COCCOCCNC(=O)CC[C@H](NC(=O)CCCCCCCCCCCCCCCCC(O)=O)C(O)=O)C(=O)NCC(=O)N[C@@H](Cc1c[nH]c2ccccc12)C(=O)N[C@@H](CCCCNC(=O)Nc1ccccc1C)C(=O)N[C@@H](CC(O)=O)C(=O)N(C)[C@@H](Cc1ccccc1)C(N)=O
: