Target
Metabotropic glutamate receptor 1
Ligand
BDBM50072170
Substrate
Meas. Tech.
ChEBML_104628
IC50
>100000±n/a nM
Citation
 Collado, IEzquerra, JMazón, APedregal, CYruretagoyena, BKingston, AETomlinson, RWright, RAJohnson, BGSchoepp, DD 2,3'-disubstituted-2-(2'-carboxycyclopropyl)glycines as potent and selective antagonists of metabotropic glutamate receptors. Bioorg Med Chem Lett 8:2849-54 (1999)  
Target
Name:
Metabotropic glutamate receptor 1
Synonyms:
GPRC1A GRM1_HUMAN Metabotropic Glutamate 1a | metabotropic glutamate 1
Type:
Enzyme
Mol. Mass.:
132358.19
Organism:
Homo sapiens (Human)
Description:
Q13255
Residue:
1194
  
Inhibitor
Name:
BDBM50072170
Synonyms:
(1S,2S,3S)-2-[1-Amino-1-carboxy-2-(9H-xanthen-9-yl)-ethyl]-3-isobutyl-cyclopropanecarboxylic acid | CHEMBL97200
Type:
Small organic molecule
Emp. Form.:
C24H27NO5
Mol. Mass.:
409.4749
SMILES:
CC(C)C[C@@H]1[C@@H]([C@H]1C(N)(CC1c2ccccc2Oc2ccccc12)C(O)=O)C(O)=O
: