Target
Adenosine receptor A3
Ligand
BDBM50389151
Substrate
Meas. Tech.
ChEMBL_1870479 (CHEMBL4371646)
EC50
316±n/a nM
Citation
 Tan, LYan, WMcCorvy, JDCheng, J Biased Ligands of G Protein-Coupled Receptors (GPCRs): Structure-Functional Selectivity Relationships (SFSRs) and Therapeutic Potential. J Med Chem 61:9841-9878 (2018)  
Target
Name:
Adenosine receptor A3
Synonyms:
A3 adenosine receptor (hA3) ADORA3 | Adenosine A3 receptor (A3AR)
Type:
G Protein-Coupled Receptor (GPCR)
Mol. Mass.:
36197.32
Organism:
Homo sapiens (Human)
Description:
P0DMS8
Residue:
318
  
Inhibitor
Name:
BDBM50389151
Synonyms:
CHEMBL2064634
Type:
Small organic molecule
Emp. Form.:
C38H29ClN6O3
Mol. Mass.:
653.128
SMILES:
CNC(=O)[C@@]12C[C@@H]1[C@H]([C@H](O)[C@@H]2O)n1cnc2c(NCc3cccc(Cl)c3)nc(nc12)C#Cc1cc2cccc3ccc4cccc1c4c23
: