Target
Beta-1 adrenergic receptor
Ligand
BDBM50072387
Substrate
Meas. Tech.
ChEBML_37376
IC50
30000±n/a nM
Citation
 Naylor, EMColandrea, VJCandelore, MRCascieri, MAColwell, LFDeng, LFeeney, WPForrest, MJHom, GJMacIntyre, DEStrader, CDTota, LWang, PRWyvratt, MJFisher, MHWeber, AE 3-Pyridylethanolamines: potent and selective human beta 3 adrenergic receptor agonists. Bioorg Med Chem Lett 8:3087-92 (1999)  
Target
Name:
Beta-1 adrenergic receptor
Synonyms:
ADRB1 ADRB1_HUMAN Beta-1 adrenoceptor adrenergic Beta1
Type:
G Protein-Coupled Receptor (GPCR)
Mol. Mass.:
51338.40
Organism:
Homo sapiens (Human)
Description:
P08588
Residue:
477
  
Inhibitor
Name:
BDBM50072387
Synonyms:
4-Chloro-N-{4-[2-((R)-2-hydroxy-2-pyridin-3-yl-ethylamino)-ethyl]-phenyl}-benzenesulfonamide | CHEMBL320228
Type:
Small organic molecule
Emp. Form.:
C21H22ClN3O3S
Mol. Mass.:
431.936
SMILES:
O[C@@H](CNCCc1ccc(NS(=O)(=O)c2ccc(Cl)cc2)cc1)c1cccnc1
: