Target
Thyrotropin-releasing hormone receptor
Ligand
BDBM50072396
Substrate
Meas. Tech.
ChEBML_225775
EC50
1800±n/a nM
Citation
 Chu, WPerlman, JHGershengorn, MCMoeller, KD Thyrotropin releasing hormone analogs: a building block approach to the construction of tetracyclic peptidomimetics. Bioorg Med Chem Lett 8:3093-6 (1999)  
Target
Name:
Thyrotropin-releasing hormone receptor
Synonyms:
TRH-R Thyroliberin receptor thyrotropin-releasing hormone R1
Type:
Enzyme Catalytic Domain
Mol. Mass.:
44568.52
Organism:
MOUSE
Description:
thyrotropin-releasing hormone R1 TRHR MOUSE::P21761
Residue:
393
  
Inhibitor
Name:
BDBM50072396
Synonyms:
7-cyclohexyl-6-(2,6-dioxo-1,7-diazaspiro[4.4]non-7-yl)-5-oxo-(8aR)-1,2,3,5,8,8a-hexahydro-3-indolizinecarboxamide | CHEMBL107238
Type:
Small organic molecule
Emp. Form.:
C22H30N4O4
Mol. Mass.:
414.498
SMILES:
NC(=O)[C@@H]1CC[C@H]2CC(C3CCCCC3)=C(N3CC[C@]4(CCC(=O)N4)C3=O)C(=O)N12
: