Target
Stromelysin-1
Ligand
BDBM50072582
Substrate
Meas. Tech.
ChEBML_102122
IC50
1.7±n/a nM
Citation
 Sheppard, GSFlorjancic, ASGiesler, JRXu, LGuo, YDavidsen, SKMarcotte, PAElmore, IAlbert, DHMagoc, TJBouska, JJGoodfellow, CLMorgan, DWSummers, JB Aryl ketones as novel replacements for the C-terminal amide bond of succinyl hydroxamate MMP inhibitors. Bioorg Med Chem Lett 8:3251-6 (1999)  
Target
Name:
Stromelysin-1
Synonyms:
MMP-3 MMP3_HUMAN Matrix metalloproteinase 3 Matrix metalloproteinase-3 (MMP-3) SL-1 Stromelysin 1 | Transin-1
Type:
Enzyme
Mol. Mass.:
53973.13
Organism:
Homo sapiens (Human)
Description:
P08254
Residue:
477
  
Inhibitor
Name:
BDBM50072582
Synonyms:
(2R,3S)-2-Allyl-N*4*-[(S)-1-benzyl-2-oxo-2-(1H-pyrrol-2-yl)-ethyl]-N*1*-hydroxy-3-isobutyl-succinamide | CHEMBL324664
Type:
Small organic molecule
Emp. Form.:
C24H31N3O4
Mol. Mass.:
425.5206
SMILES:
CC(C)C[C@H]([C@H](CC=C)C(=O)NO)C(=O)N[C@@H](Cc1ccccc1)C(=O)c1ccc[nH]1
: