Target
Growth hormone secretagogue receptor type 1
Ligand
BDBM50073032
Substrate
Meas. Tech.
ChEBML_173122
EC50
16±n/a nM
Citation
 Yang, LMorriello, GPrendergast, KCheng, KJacks, TChan, WWSchleim, KDSmith, RGPatchett, AA Potent 3-spiropiperidine growth hormone secretagogues. Bioorg Med Chem Lett 8:107-12 (1999)  
Target
Name:
Growth hormone secretagogue receptor type 1
Synonyms:
GH-releasing peptide receptor GHS-R Ghrelin receptor Growth hormone secretagogue receptor type 1
Type:
PROTEIN
Mol. Mass.:
40970.19
Organism:
Rattus norvegicus
Description:
ChEMBL_11556
Residue:
364
  
Inhibitor
Name:
BDBM50073032
Synonyms:
1N-[2-(5-hydroxy-1,3,4,4a,5,10a-hexahydro-2H-chromeno[2,3-c]pyridin-2-yl)-1-(1H-3-indolylmethyl)-2-oxo-(1R)-ethyl]-2-amino-2-methylpropanamide | CHEMBL275795
Type:
Small organic molecule
Emp. Form.:
C28H34N4O4
Mol. Mass.:
490.594
SMILES:
CC(C)(N)C(=O)N[C@H](Cc1c[nH]c2ccccc12)C(=O)N1CCC2(CC1)CC(O)c1ccccc1O2
: